{"text_format":"1","workbook":"xlsx","n_sheets":19,"sheets":[" Income","Running Totals","Bank Recon","July ","August ","Sept ","Oct ","Nov ","Dec ","Jan ","Feb ","Mar","April ","May ","June ","Categories","Income categories","setup","temp"],"not_rendered":{"charts":0,"images":0,"macros":1,"external_links":0,"defined_names":7,"comments":0,"pivot_tables":0},"unopened":[],"bounds":{"document_bytes":16777216,"sheet_cells":100000,"rows_first":2000,"rows_last":500,"rows_between":2000,"halvings":0,"cell_chars":16384,"cell_head_chars":4096},"cells_cut":0,"cells_raw":0,"read":"whole","date_system":"1900"}

{"sheet":" Income","index":0,"n_rows":181,"n_cols":23,"rows_kept":181,"cut":false,"hidden":false,"merged":[]}
["Date","Grant Name","Amount","Category Description","Description","Category No."]
[null,null,null,null,null,{"$f":"IF(D2>\" \",LOOKUP(D2,INCOME_LIST,setup!$C$1:$C$27),\" \")","v":" "}]
[null,null,null,null,null,{"$f":"IF(D3>\" \",LOOKUP(D3,INCOME_LIST,setup!$C$1:$C$27),\" \")","v":" "}]
[null,null,null,null,null,{"$f":"IF(D4>\" \",LOOKUP(D4,INCOME_LIST,setup!$C$1:$C$27),\" \")","v":" "}]
[null,null,null,null,null,{"$f":"IF(D5>\" \",LOOKUP(D5,INCOME_LIST,setup!$C$1:$C$27),\" \")","v":" "}]
[null,null,null,null,null,{"$f":"IF(D6>\" \",LOOKUP(D6,INCOME_LIST,setup!$C$1:$C$27),\" \")","v":" "}]
[null,null,null,null,null,{"$f":"IF(D7>\" \",LOOKUP(D7,INCOME_LIST,setup!$C$1:$C$27),\" \")","v":" "}]
[null,null,null,null,null,{"$f":"IF(D8>\" \",LOOKUP(D8,INCOME_LIST,setup!$C$1:$C$27),\" \")","v":" "}]
{"$rows_left_out":174}
{"sheet":"Running Totals","index":1,"n_rows":75,"n_cols":19,"rows_kept":75,"cut":false,"hidden":false,"merged":[]}
[null,null,"July","August","September","October","November","December","January","February","March","April","May","June","TOTAL","EXPENDITURE","INCOME","OPENING BALANCE","BALANCE B/F"]
[1,"CAPITATION"]
[12.01,"Cleaning Wages",{"$f":"SUMIF('July '!$I$2:$I$82,$A3,'July '!$F$2:$F$80)","v":0},{"$f":"SUMIF('August '!$I$2:$I$80,$A3,'August '!$F$2:$F$80)","v":0},{"$f":"SUMIF('Sept '!$I$2:$I$80,$A3,'Sept '!$F$2:$F$80)","v":0},{"$f":"SUMIF('Oct '!$I$2:$I$80,$A3,'Oct '!$F$2:$F$80)","v":0},{"$f":"SUMIF('Nov '!$I$2:$I$80,$A3,'Nov '!$F$2:$F$80)","v":0},{"$f":"SUMIF('Dec '!$I$2:$I$80,$A3,'Dec '!$F$2:$F$80)","v":0},{"$f":"SUMIF('Jan '!$I$2:$I$80,$A3,'Jan '!$F$2:$F$80)","v":0},{"$f":"SUMIF('Feb '!$I$2:$I$80,$A3,'Feb '!$F$2:$F$80)","v":0},{"$f":"SUMIF(Mar!$I$2:$I$80,$A3,Mar!$F$2:$F$80)","v":0},{"$f":"SUMIF('April '!$I$2:$I$80,$A3,'April '!$F$2:$F$80)","v":0},{"$f":"SUMIF('May '!$I$2:$I$80,$A3,'May '!$F$2:$F$80)","v":0},{"$f":"SUMIF('June '!$I$2:$I$80,$A3,'June '!$F$2:$F$80)","v":0},{"$f":"SUM(C3:N3)","v":0}]
[12.02,"Cleaning Materials",{"$f":"SUMIF('July '!$I$2:$I$82,$A4,'July '!$F$2:$F$80)","v":0},{"$f":"SUMIF('August '!$I$2:$I$80,$A4,'August '!$F$2:$F$80)","v":0},{"$f":"SUMIF('Sept '!$I$2:$I$80,$A4,'Sept '!$F$2:$F$80)","v":0},{"$f":"SUMIF('Oct '!$I$2:$I$80,$A4,'Oct '!$F$2:$F$80)","v":0},{"$f":"SUMIF('Nov '!$I$2:$I$80,$A4,'Nov '!$F$2:$F$80)","v":0},{"$f":"SUMIF('Dec '!$I$2:$I$80,$A4,'Dec '!$F$2:$F$80)","v":0},{"$f":"SUMIF('Jan '!$I$2:$I$80,$A4,'Jan '!$F$2:$F$80)","v":0},{"$f":"SUMIF('Feb '!$I$2:$I$80,$A4,'Feb '!$F$2:$F$80)","v":0},{"$f":"SUMIF(Mar!$I$2:$I$80,$A4,Mar!$F$2:$F$80)","v":0},{"$f":"SUMIF('April '!$I$2:$I$80,$A4,'April '!$F$2:$F$80)","v":0},{"$f":"SUMIF('May '!$I$2:$I$80,$A4,'May '!$F$2:$F$80)","v":0},{"$f":"SUMIF('June '!$I$2:$I$80,$A4,'June '!$F$2:$F$80)","v":0},{"$f":"SUM(C4:N4)","v":0}]
[12.03,"Sanitary",{"$f":"SUMIF('July '!$I$2:$I$82,$A5,'July '!$F$2:$F$80)","v":0},{"$f":"SUMIF('August '!$I$2:$I$80,$A5,'August '!$F$2:$F$80)","v":0},{"$f":"SUMIF('Sept '!$I$2:$I$80,$A5,'Sept '!$F$2:$F$80)","v":0},{"$f":"SUMIF('Oct '!$I$2:$I$80,$A5,'Oct '!$F$2:$F$80)","v":0},{"$f":"SUMIF('Nov '!$I$2:$I$80,$A5,'Nov '!$F$2:$F$80)","v":0},{"$f":"SUMIF('Dec '!$I$2:$I$80,$A5,'Dec '!$F$2:$F$80)","v":0},{"$f":"SUMIF('Jan '!$I$2:$I$80,$A5,'Jan '!$F$2:$F$80)","v":0},{"$f":"SUMIF('Feb '!$I$2:$I$80,$A5,'Feb '!$F$2:$F$80)","v":0},{"$f":"SUMIF(Mar!$I$2:$I$80,$A5,Mar!$F$2:$F$80)","v":0},{"$f":"SUMIF('April '!$I$2:$I$80,$A5,'April '!$F$2:$F$80)","v":0},{"$f":"SUMIF('May '!$I$2:$I$80,$A5,'May '!$F$2:$F$80)","v":0},{"$f":"SUMIF('June '!$I$2:$I$80,$A5,'June '!$F$2:$F$80)","v":0},0]
[12.04,"Petty Cash ",{"$f":"SUMIF('July '!$I$2:$I$82,$A6,'July '!$F$2:$F$80)","v":0},{"$f":"SUMIF('August '!$I$2:$I$80,$A6,'August '!$F$2:$F$80)","v":0},{"$f":"SUMIF('Sept '!$I$2:$I$80,$A6,'Sept '!$F$2:$F$80)","v":0},{"$f":"SUMIF('Oct '!$I$2:$I$80,$A6,'Oct '!$F$2:$F$80)","v":0},{"$f":"SUMIF('Nov '!$I$2:$I$80,$A6,'Nov '!$F$2:$F$80)","v":0},{"$f":"SUMIF('Dec '!$I$2:$I$80,$A6,'Dec '!$F$2:$F$80)","v":0},{"$f":"SUMIF('Jan '!$I$2:$I$80,$A6,'Jan '!$F$2:$F$80)","v":0},{"$f":"SUMIF('Feb '!$I$2:$I$80,$A6,'Feb '!$F$2:$F$80)","v":0},{"$f":"SUMIF(Mar!$I$2:$I$80,$A6,Mar!$F$2:$F$80)","v":0},{"$f":"SUMIF('April '!$I$2:$I$80,$A6,'April '!$F$2:$F$80)","v":0},{"$f":"SUMIF('May '!$I$2:$I$80,$A6,'May '!$F$2:$F$80)","v":0},{"$f":"SUMIF('June '!$I$2:$I$80,$A6,'June '!$F$2:$F$80)","v":0},0]
[12.05,"Furniture&Fittings",{"$f":"SUMIF('July '!$I$2:$I$82,$A7,'July '!$F$2:$F$80)","v":0},{"$f":"SUMIF('August '!$I$2:$I$80,$A7,'August '!$F$2:$F$80)","v":0},{"$f":"SUMIF('Sept '!$I$2:$I$80,$A7,'Sept '!$F$2:$F$80)","v":0},{"$f":"SUMIF('Oct '!$I$2:$I$80,$A7,'Oct '!$F$2:$F$80)","v":0},{"$f":"SUMIF('Nov '!$I$2:$I$80,$A7,'Nov '!$F$2:$F$80)","v":0},{"$f":"SUMIF('Dec '!$I$2:$I$80,$A7,'Dec '!$F$2:$F$80)","v":0},{"$f":"SUMIF('Jan '!$I$2:$I$80,$A7,'Jan '!$F$2:$F$80)","v":0},{"$f":"SUMIF('Feb '!$I$2:$I$80,$A7,'Feb '!$F$2:$F$80)","v":0},{"$f":"SUMIF(Mar!$I$2:$I$80,$A7,Mar!$F$2:$F$80)","v":0},{"$f":"SUMIF('April '!$I$2:$I$80,$A7,'April '!$F$2:$F$80)","v":0},{"$f":"SUMIF('May '!$I$2:$I$80,$A7,'May '!$F$2:$F$80)","v":0},{"$f":"SUMIF('June '!$I$2:$I$80,$A7,'June '!$F$2:$F$80)","v":0},0]
[12.06,"Maintenance&Repairs",{"$f":"SUMIF('July '!$I$2:$I$82,$A8,'July '!$F$2:$F$80)","v":0},{"$f":"SUMIF('August '!$I$2:$I$80,$A8,'August '!$F$2:$F$80)","v":0},{"$f":"SUMIF('Sept '!$I$2:$I$80,$A8,'Sept '!$F$2:$F$80)","v":0},{"$f":"SUMIF('Oct '!$I$2:$I$80,$A8,'Oct '!$F$2:$F$80)","v":0},{"$f":"SUMIF('Nov '!$I$2:$I$80,$A8,'Nov '!$F$2:$F$80)","v":0},{"$f":"SUMIF('Dec '!$I$2:$I$80,$A8,'Dec '!$F$2:$F$80)","v":0},{"$f":"SUMIF('Jan '!$I$2:$I$80,$A8,'Jan '!$F$2:$F$80)","v":0},{"$f":"SUMIF('Feb '!$I$2:$I$80,$A8,'Feb '!$F$2:$F$80)","v":0},{"$f":"SUMIF(Mar!$I$2:$I$80,$A8,Mar!$F$2:$F$80)","v":0},{"$f":"SUMIF('April '!$I$2:$I$80,$A8,'April '!$F$2:$F$80)","v":0},{"$f":"SUMIF('May '!$I$2:$I$80,$A8,'May '!$F$2:$F$80)","v":0},{"$f":"SUMIF('June '!$I$2:$I$80,$A8,'June '!$F$2:$F$80)","v":0},0]
{"$rows_left_out":68}
{"sheet":"Bank Recon","index":2,"n_rows":14,"n_cols":4,"rows_kept":14,"cut":false,"hidden":false,"merged":[[0,0,0,1]]}
["Bank Reconciliation"]
[]
[]
["Account Balance ",0,"at end june 08"]
[]
["Total Income to Date",{"$f":"'Running Totals'!Q75","v":0},"1st july 08 - 30thJune 09"]
[null,null,null,"Balance Expediture"]
["Expenditure to Date",{"$f":"'Running Totals'!P75","v":0},"1st july 08 - 30thJune 09",{"$f":"B4+B6-B8","v":0}]
{"$rows_left_out":7}
{"sheet":"July ","index":3,"n_rows":88,"n_cols":9,"rows_kept":88,"cut":false,"hidden":false,"merged":[]}
["Cheque No.","Status","Type","Date","Payee","Amount","Category Description","Description","Category No."]
[null,"Outstanding","Laser",null,null,null,null,null,{"$f":"IF(G2>\" \",LOOKUP(G2,PAYLIST,setup!$A$1:$A$100),\" \")","v":" "}]
[null,"Outstanding","Cheque",null,null,null,null,null,{"$f":"IF(G3>\" \",LOOKUP(G3,PAYLIST,setup!$A$1:$A$100),\" \")","v":" "}]
[null,"Outstanding","Cheque",null,null,null,null,null,{"$f":"IF(G4>\" \",LOOKUP(G4,PAYLIST,setup!$A$1:$A$100),\" \")","v":" "}]
[null,"Outstanding","Cheque",null,null,null,null,null,{"$f":"IF(G5>\" \",LOOKUP(G5,PAYLIST,setup!$A$1:$A$100),\" \")","v":" "}]
[null,"Outstanding","Cheque",null,null,null,null,null,{"$f":"IF(G6>\" \",LOOKUP(G6,PAYLIST,setup!$A$1:$A$100),\" \")","v":" "}]
[null,"Outstanding","Cheque",null,null,null,null,null,{"$f":"IF(G7>\" \",LOOKUP(G7,PAYLIST,setup!$A$1:$A$100),\" \")","v":" "}]
[null,"Outstanding","Cheque",null,null,null,null,null,{"$f":"IF(G8>\" \",LOOKUP(G8,PAYLIST,setup!$A$1:$A$100),\" \")","v":" "}]
{"$rows_left_out":81}
{"sheet":"August ","index":4,"n_rows":88,"n_cols":9,"rows_kept":88,"cut":false,"hidden":false,"merged":[]}
["Cheque No.","Status","Type","Date","Payee","Amount","Category Description","Description","Category No."]
[null,"Outstanding","Cheque",null,null,null,null,null,{"$f":"IF(G2>\" \",LOOKUP(G2,PAYLIST,setup!$A$1:$A$100),\" \")","v":" "}]
[null,"Outstanding","Cheque",null,null,null,null,null,{"$f":"IF(G3>\" \",LOOKUP(G3,PAYLIST,setup!$A$1:$A$100),\" \")","v":" "}]
[null,"Outstanding","Cheque",null,null,null,null,null,{"$f":"IF(G4>\" \",LOOKUP(G4,PAYLIST,setup!$A$1:$A$100),\" \")","v":" "}]
[null,"Outstanding","Cheque",null,null,null,null,null,{"$f":"IF(G5>\" \",LOOKUP(G5,PAYLIST,setup!$A$1:$A$100),\" \")","v":" "}]
[null,"Outstanding","Cheque",null,null,null,null,null,{"$f":"IF(G6>\" \",LOOKUP(G6,PAYLIST,setup!$A$1:$A$100),\" \")","v":" "}]
[null,"Outstanding","Cheque",null,null,null,null,null,{"$f":"IF(G7>\" \",LOOKUP(G7,PAYLIST,setup!$A$1:$A$100),\" \")","v":" "}]
[null,"Outstanding","Cheque",null,null,null,null,null,{"$f":"IF(G8>\" \",LOOKUP(G8,PAYLIST,setup!$A$1:$A$100),\" \")","v":" "}]
{"$rows_left_out":81}
{"sheet":"Sept ","index":5,"n_rows":88,"n_cols":9,"rows_kept":88,"cut":false,"hidden":false,"merged":[]}
["Cheque No.","Status","Type","Date","Payee","Amount","Category Description","Description","Category No."]
[null,"Outstanding","Cheque",null,null,null,null,null,{"$f":"IF(G2>\" \",LOOKUP(G2,PAYLIST,setup!$A$1:$A$100),\" \")","v":" "}]
[null,"Outstanding","Cheque",null,null,null,null,null,{"$f":"IF(G3>\" \",LOOKUP(G3,PAYLIST,setup!$A$1:$A$100),\" \")","v":" "}]
[null,"Outstanding","Cheque",null,null,null,null,null,{"$f":"IF(G4>\" \",LOOKUP(G4,PAYLIST,setup!$A$1:$A$100),\" \")","v":" "}]
[null,"Outstanding","Cheque",null,null,null,null,null,{"$f":"IF(G5>\" \",LOOKUP(G5,PAYLIST,setup!$A$1:$A$100),\" \")","v":" "}]
[null,"Outstanding","Cheque",null,null,null,null,null,{"$f":"IF(G6>\" \",LOOKUP(G6,PAYLIST,setup!$A$1:$A$100),\" \")","v":" "}]
[null,"Outstanding","Cheque",null,null,null,null,null,{"$f":"IF(G7>\" \",LOOKUP(G7,PAYLIST,setup!$A$1:$A$100),\" \")","v":" "}]
[null,"Outstanding","Cheque",null,null,null,null,null,{"$f":"IF(G8>\" \",LOOKUP(G8,PAYLIST,setup!$A$1:$A$100),\" \")","v":" "}]
{"$rows_left_out":81}
{"sheet":"Oct ","index":6,"n_rows":88,"n_cols":9,"rows_kept":88,"cut":false,"hidden":false,"merged":[]}
["Cheque No.","Status","Type","Date","Payee","Amount","Category Description","Description","Category No."]
[null,"Outstanding","Cheque",null,null,null,null,null,{"$f":"IF(G2>\" \",LOOKUP(G2,PAYLIST,setup!$A$1:$A$100),\" \")","v":" "}]
[null,"Outstanding","Cheque",null,null,null,null,null,{"$f":"IF(G3>\" \",LOOKUP(G3,PAYLIST,setup!$A$1:$A$100),\" \")","v":" "}]
[null,"Outstanding","Cheque",null,null,null,null,null,{"$f":"IF(G4>\" \",LOOKUP(G4,PAYLIST,setup!$A$1:$A$100),\" \")","v":" "}]
[null,"Outstanding","Cheque",null,null,null,null,null,{"$f":"IF(G5>\" \",LOOKUP(G5,PAYLIST,setup!$A$1:$A$100),\" \")","v":" "}]
[null,"Outstanding","Cheque",null,null,null,null,null,{"$f":"IF(G6>\" \",LOOKUP(G6,PAYLIST,setup!$A$1:$A$100),\" \")","v":" "}]
[null,"Outstanding","Cheque",null,null,null,null,null,{"$f":"IF(G7>\" \",LOOKUP(G7,PAYLIST,setup!$A$1:$A$100),\" \")","v":" "}]
[null,"Outstanding","Cheque",null,null,null,null,null,{"$f":"IF(G8>\" \",LOOKUP(G8,PAYLIST,setup!$A$1:$A$100),\" \")","v":" "}]
{"$rows_left_out":81}
{"sheet":"Nov ","index":7,"n_rows":88,"n_cols":9,"rows_kept":88,"cut":false,"hidden":false,"merged":[]}
["Cheque No.","Status","Type","Date","Payee","Amount","Category Description","Description","Category No."]
[null,"Outstanding","Cheque",null,null,null,null,null,{"$f":"IF(G2>\" \",LOOKUP(G2,PAYLIST,setup!$A$1:$A$100),\" \")","v":" "}]
[null,"Outstanding","Cheque",null,null,null,null,null,{"$f":"IF(G3>\" \",LOOKUP(G3,PAYLIST,setup!$A$1:$A$100),\" \")","v":" "}]
[null,"Outstanding","Cheque",null,null,null,null,null,{"$f":"IF(G4>\" \",LOOKUP(G4,PAYLIST,setup!$A$1:$A$100),\" \")","v":" "}]
[null,"Outstanding","Cheque",null,null,null,null,null,{"$f":"IF(G5>\" \",LOOKUP(G5,PAYLIST,setup!$A$1:$A$100),\" \")","v":" "}]
[null,"Outstanding","Cheque",null,null,null,null,null,{"$f":"IF(G6>\" \",LOOKUP(G6,PAYLIST,setup!$A$1:$A$100),\" \")","v":" "}]
[null,"Outstanding","Cheque",null,null,null,null,null,{"$f":"IF(G7>\" \",LOOKUP(G7,PAYLIST,setup!$A$1:$A$100),\" \")","v":" "}]
[null,"Outstanding","Cheque",null,null,null,null,null,{"$f":"IF(G8>\" \",LOOKUP(G8,PAYLIST,setup!$A$1:$A$100),\" \")","v":" "}]
{"$rows_left_out":81}
{"sheet":"Dec ","index":8,"n_rows":88,"n_cols":9,"rows_kept":88,"cut":false,"hidden":false,"merged":[]}
["Cheque No.","Status","Type","Date","Payee","Amount","Category Description","Description","Category No."]
[null,"Outstanding","Cheque",null,null,null,null,null,{"$f":"IF(G2>\" \",LOOKUP(G2,PAYLIST,setup!$A$1:$A$100),\" \")","v":" "}]
[null,"Outstanding","Cheque",null,null,null,null,null,{"$f":"IF(G3>\" \",LOOKUP(G3,PAYLIST,setup!$A$1:$A$100),\" \")","v":" "}]
[null,"Outstanding","Cheque",null,null,null,null,null,{"$f":"IF(G4>\" \",LOOKUP(G4,PAYLIST,setup!$A$1:$A$100),\" \")","v":" "}]
[null,"Outstanding","Cheque",null,null,null,null,null,{"$f":"IF(G5>\" \",LOOKUP(G5,PAYLIST,setup!$A$1:$A$100),\" \")","v":" "}]
[null,"Outstanding","Cheque",null,null,null,null,null,{"$f":"IF(G6>\" \",LOOKUP(G6,PAYLIST,setup!$A$1:$A$100),\" \")","v":" "}]
[null,"Outstanding","Cheque",null,null,null,null,null,{"$f":"IF(G7>\" \",LOOKUP(G7,PAYLIST,setup!$A$1:$A$100),\" \")","v":" "}]
[null,"Outstanding","Cheque",null,null,null,null,null,{"$f":"IF(G8>\" \",LOOKUP(G8,PAYLIST,setup!$A$1:$A$100),\" \")","v":" "}]
{"$rows_left_out":81}
{"sheet":"Jan ","index":9,"n_rows":88,"n_cols":9,"rows_kept":88,"cut":false,"hidden":false,"merged":[]}
["Cheque No.","Status","Type","Date","Payee","Amount","Category Description","Description","Category No."]
[null,"Outstanding","Cheque",null,null,null,null,null,{"$f":"IF(G2>\" \",LOOKUP(G2,PAYLIST,setup!$A$1:$A$100),\" \")","v":" "}]
[null,"Outstanding","Cheque",null,null,null,null,null,{"$f":"IF(G3>\" \",LOOKUP(G3,PAYLIST,setup!$A$1:$A$100),\" \")","v":" "}]
[null,"Outstanding","Cheque",null,null,null,null,null,{"$f":"IF(G4>\" \",LOOKUP(G4,PAYLIST,setup!$A$1:$A$100),\" \")","v":" "}]
[null,"Outstanding","Cheque",null,null,null,null,null,{"$f":"IF(G5>\" \",LOOKUP(G5,PAYLIST,setup!$A$1:$A$100),\" \")","v":" "}]
[null,"Outstanding","Cheque",null,null,null,null,null,{"$f":"IF(G6>\" \",LOOKUP(G6,PAYLIST,setup!$A$1:$A$100),\" \")","v":" "}]
[null,"Outstanding","Cheque",null,null,null,null,null,{"$f":"IF(G7>\" \",LOOKUP(G7,PAYLIST,setup!$A$1:$A$100),\" \")","v":" "}]
[null,"Outstanding","Cheque",null,null,null,null,null,{"$f":"IF(G8>\" \",LOOKUP(G8,PAYLIST,setup!$A$1:$A$100),\" \")","v":" "}]
{"$rows_left_out":81}
{"sheet":"Feb ","index":10,"n_rows":88,"n_cols":9,"rows_kept":88,"cut":false,"hidden":false,"merged":[]}
["Cheque No.","Status","Type","Date","Payee","Amount","Category Description","Description","Category No."]
[null,"Outstanding","Cheque",null,null,null,null,null,{"$f":"IF(G2>\" \",LOOKUP(G2,PAYLIST,setup!$A$1:$A$100),\" \")","v":" "}]
[null,"Outstanding","Cheque",null,null,null,null,null,{"$f":"IF(G3>\" \",LOOKUP(G3,PAYLIST,setup!$A$1:$A$100),\" \")","v":" "}]
[null,"Outstanding","Cheque",null,null,null,null,null,{"$f":"IF(G4>\" \",LOOKUP(G4,PAYLIST,setup!$A$1:$A$100),\" \")","v":" "}]
[null,"Outstanding","Cheque",null,null,null,null,null,{"$f":"IF(G5>\" \",LOOKUP(G5,PAYLIST,setup!$A$1:$A$100),\" \")","v":" "}]
[null,"Outstanding","Cheque",null,null,null,null,null,{"$f":"IF(G6>\" \",LOOKUP(G6,PAYLIST,setup!$A$1:$A$100),\" \")","v":" "}]
[null,"Outstanding","Cheque",null,null,null,null,null,{"$f":"IF(G7>\" \",LOOKUP(G7,PAYLIST,setup!$A$1:$A$100),\" \")","v":" "}]
[null,"Outstanding","Cheque",null,null,null,null,null,{"$f":"IF(G8>\" \",LOOKUP(G8,PAYLIST,setup!$A$1:$A$100),\" \")","v":" "}]
{"$rows_left_out":81}
{"sheet":"Mar","index":11,"n_rows":88,"n_cols":9,"rows_kept":88,"cut":false,"hidden":false,"merged":[]}
["Cheque No.","Status","Type","Date","Payee","Amount","Category Description","Description","Category No."]
[null,"Outstanding","Cheque",null,null,null,null,null,{"$f":"IF(G2>\" \",LOOKUP(G2,PAYLIST,setup!$A$1:$A$100),\" \")","v":" "}]
[null,"Outstanding","Cheque",null,null,null,null,null,{"$f":"IF(G3>\" \",LOOKUP(G3,PAYLIST,setup!$A$1:$A$100),\" \")","v":" "}]
[null,"Outstanding","Cheque",null,null,null,null,null,{"$f":"IF(G4>\" \",LOOKUP(G4,PAYLIST,setup!$A$1:$A$100),\" \")","v":" "}]
[null,"Outstanding","Cheque",null,null,null,null,null,{"$f":"IF(G5>\" \",LOOKUP(G5,PAYLIST,setup!$A$1:$A$100),\" \")","v":" "}]
[null,"Outstanding","Cheque",null,null,null,null,null,{"$f":"IF(G6>\" \",LOOKUP(G6,PAYLIST,setup!$A$1:$A$100),\" \")","v":" "}]
[null,"Outstanding","Cheque",null,null,null,null,null,{"$f":"IF(G7>\" \",LOOKUP(G7,PAYLIST,setup!$A$1:$A$100),\" \")","v":" "}]
[null,"Outstanding","Cheque",null,null,null,null,null,{"$f":"IF(G8>\" \",LOOKUP(G8,PAYLIST,setup!$A$1:$A$100),\" \")","v":" "}]
{"$rows_left_out":81}
{"sheet":"April ","index":12,"n_rows":88,"n_cols":9,"rows_kept":88,"cut":false,"hidden":false,"merged":[]}
["Cheque No.","Status","Type","Date","Payee","Amount","Category Description","Description","Category No."]
[null,"Outstanding","Cheque",null,null,null,null,null,{"$f":"IF(G2>\" \",LOOKUP(G2,PAYLIST,setup!$A$1:$A$100),\" \")","v":" "}]
[null,"Outstanding","Cheque",null,null,null,null,null,{"$f":"IF(G3>\" \",LOOKUP(G3,PAYLIST,setup!$A$1:$A$100),\" \")","v":" "}]
[null,"Outstanding","Cheque",null,null,null,null,null,{"$f":"IF(G4>\" \",LOOKUP(G4,PAYLIST,setup!$A$1:$A$100),\" \")","v":" "}]
[null,"Outstanding","Cheque",null,null,null,null,null,{"$f":"IF(G5>\" \",LOOKUP(G5,PAYLIST,setup!$A$1:$A$100),\" \")","v":" "}]
[null,"Outstanding","Cheque",null,null,null,null,null,{"$f":"IF(G6>\" \",LOOKUP(G6,PAYLIST,setup!$A$1:$A$100),\" \")","v":" "}]
[null,"Outstanding","Cheque",null,null,null,null,null,{"$f":"IF(G7>\" \",LOOKUP(G7,PAYLIST,setup!$A$1:$A$100),\" \")","v":" "}]
[null,"Outstanding","Cheque",null,null,null,null,null,{"$f":"IF(G8>\" \",LOOKUP(G8,PAYLIST,setup!$A$1:$A$100),\" \")","v":" "}]
{"$rows_left_out":81}
{"sheet":"May ","index":13,"n_rows":88,"n_cols":9,"rows_kept":88,"cut":false,"hidden":false,"merged":[]}
["Cheque No.","Status","Type","Date","Payee","Amount","Category Description","Description","Category No."]
[null,"Outstanding","Cheque",null,null,null,null,null,{"$f":"IF(G2>\" \",LOOKUP(G2,PAYLIST,setup!$A$1:$A$100),\" \")","v":" "}]
[null,"Outstanding","Cheque",null,null,null,null,null,{"$f":"IF(G3>\" \",LOOKUP(G3,PAYLIST,setup!$A$1:$A$100),\" \")","v":" "}]
[null,"Outstanding","Cheque",null,null,null,null,null,{"$f":"IF(G4>\" \",LOOKUP(G4,PAYLIST,setup!$A$1:$A$100),\" \")","v":" "}]
[null,"Outstanding","Cheque",null,null,null,null,null,{"$f":"IF(G5>\" \",LOOKUP(G5,PAYLIST,setup!$A$1:$A$100),\" \")","v":" "}]
[null,"Outstanding","Cheque",null,null,null,null,null,{"$f":"IF(G6>\" \",LOOKUP(G6,PAYLIST,setup!$A$1:$A$100),\" \")","v":" "}]
[null,"Outstanding","Cheque",null,null,null,null,null,{"$f":"IF(G7>\" \",LOOKUP(G7,PAYLIST,setup!$A$1:$A$100),\" \")","v":" "}]
[null,"Outstanding","Cheque",null,null,null,null,null,{"$f":"IF(G8>\" \",LOOKUP(G8,PAYLIST,setup!$A$1:$A$100),\" \")","v":" "}]
{"$rows_left_out":81}
{"sheet":"June ","index":14,"n_rows":88,"n_cols":9,"rows_kept":88,"cut":false,"hidden":false,"merged":[]}
["Cheque No.","Status","Type","Date","Payee","Amount","Category Description","Description","Category No."]
[null,"Outstanding","Cheque",null,null,null,null,null,{"$f":"IF(G2>\" \",LOOKUP(G2,PAYLIST,setup!$A$1:$A$100),\" \")","v":" "}]
[null,"Outstanding","Cheque",null,null,null,null,null,{"$f":"IF(G3>\" \",LOOKUP(G3,PAYLIST,setup!$A$1:$A$100),\" \")","v":" "}]
[null,"Outstanding","Cheque",null,null,null,null,null,{"$f":"IF(G4>\" \",LOOKUP(G4,PAYLIST,setup!$A$1:$A$100),\" \")","v":" "}]
[null,"Outstanding","Cheque",null,null,null,null,null,{"$f":"IF(G5>\" \",LOOKUP(G5,PAYLIST,setup!$A$1:$A$100),\" \")","v":" "}]
[null,"Outstanding","Cheque",null,null,null,null,null,{"$f":"IF(G6>\" \",LOOKUP(G6,PAYLIST,setup!$A$1:$A$100),\" \")","v":" "}]
[null,"Outstanding","Cheque",null,null,null,null,null,{"$f":"IF(G7>\" \",LOOKUP(G7,PAYLIST,setup!$A$1:$A$100),\" \")","v":" "}]
[null,"Outstanding","Cheque",null,null,null,null,null,{"$f":"IF(G8>\" \",LOOKUP(G8,PAYLIST,setup!$A$1:$A$100),\" \")","v":" "}]
{"$rows_left_out":81}
{"sheet":"Categories","index":15,"n_rows":146,"n_cols":6,"rows_kept":146,"cut":false,"hidden":false,"merged":[]}
[null,null,"Payment Categories",null,"Income Categories"]
["Category Code","Group Code","Description",null,"Category Code","Description"]
[]
[12.01,1,"Cleaning Wages",null,12,"Capitation"]
[12.02,1,"Cleaning Materials"]
[12.03,1,"Sanitary"]
[12.04,1,"Petty Cash "]
[12.05,1,"Furniture & Fittings"]
{"$rows_left_out":139}
{"sheet":"Income categories","index":16,"n_rows":25,"n_cols":2,"rows_kept":25,"cut":false,"hidden":false,"merged":[]}
[12,"CAPITATION"]
[13,"DEIS SSP"]
[14,"DES FREE BOOK"]
[15,"DES SUPERVISION"]
[16,"DES TV LICENCE"]
[17,"DES NN GRANT"]
[18,"DES RS GRANT"]
[19,"DES MINOR WORKS"]
{"$rows_left_out":18}
{"sheet":"setup","index":17,"n_rows":54,"n_cols":7,"rows_kept":54,"cut":false,"hidden":false,"merged":[]}
[]
[12.09,"Advertising & Interviewing",12,"Capitation"]
[12.16,"Bank Charges& ProfessionalFees",13,"DEIS SSP",null,"Cashed","Cheque"]
[21.01,"Caretaker/Secretary",21,"DES ANCILLIARY GRANT",null,"Cancelled","Cash"]
[12.23,"Catering",29,"DES CURRICULUM GRANT",null,"Outstanding","Laser"]
[12.02,"Cleaning Materials",14,"DES FREE BOOK",null,"Paid","Visa"]
[12.01,"Cleaning Wages",23,"DES ICT GRANT",null,null,"Transfer"]
[13.04,"DEIS Capitation",25,"DES LIBRARY"]
{"$rows_left_out":47}
{"sheet":"temp","index":18,"n_rows":0,"n_cols":0,"rows_kept":0,"cut":false,"hidden":false,"merged":[]}